"Groups A,B,C,D",Date of referral to our center,Sex,Age in months,Hospitalization,COVID-19,Diagnosis by ICD-10,Epidemiological anamnesis,COVID-19 symptoms,Flu A,Flu B,General condition,T °C,Gastroint. S.,Other respiratory s.,Other symptoms,Rash,Cough,Seizures,Rhinorrhoea ,Sore throat/ pharyngeal erythema,Dyspnea,Vomiting,Abdominal pain,Diarrhea,Myalgia,General weakness,Fatigue,Chills,Irritability,Headache,Anosmia/ageusia
2,2,0,117,1,0,6.0,0,1,0.0,0.0,2.0,1.0,0,0,1,0,0,0,0,0,0,0,0,0,0,0,0,0,0,0,0
2,2,1,11,1,0,1.0,0,1,,,2.0,1.0,1,1,0,0,0,0,0,1,0,1,0,0,0,0,0,0,0,0,0
2,2,1,8,0,0,6.0,0,1,,,2.0,1.0,0,1,1,0,0,0,0,0,0,0,0,0,0,0,0,0,0,0,0
2,2,1,47,1,0,1.0,0,1,,,2.0,1.0,0,1,0,0,1,0,1,1,0,0,0,0,0,0,0,0,0,0,0
2,2,1,13,0,0,0.0,0,1,0.0,0.0,2.0,1.0,0,1,0,0,0,0,0,1,0,0,0,0,0,0,0,0,0,0,0
2,1,1,14,1,0,1.0,0,1,0.0,0.0,2.0,1.0,0,1,0,0,1,0,0,1,0,0,0,0,0,0,0,0,0,0,0
3,2,0,87,0,0,3.0,0,0,,,2.0,0.0,1,0,1,0,0,0,0,0,0,1,1,0,0,0,0,0,0,0,0
2,1,1,11,1,0,1.0,0,1,0.0,0.0,2.0,1.0,1,0,0,0,0,0,0,0,0,0,0,1,0,0,0,0,0,0,0
2,2,1,33,1,0,1.0,0,1,0.0,0.0,2.0,1.0,0,1,1,0,0,1,0,1,0,0,0,0,0,0,0,0,0,0,0
2,1,0,2,1,0,1.0,0,1,0.0,0.0,2.0,1.0,0,1,0,0,0,0,0,1,0,0,0,0,0,0,0,0,0,0,0
2,1,0,167,0,0,0.0,0,1,,,2.0,1.0,0,1,1,0,1,0,0,1,0,0,0,0,0,0,0,0,0,0,0
2,2,0,53,1,0,1.0,0,1,,,2.0,1.0,1,1,1,0,0,0,0,1,0,1,1,1,0,0,0,0,0,1,0
0,1,1,46,0,0,1.0,1,1,0.0,0.0,2.0,1.0,1,1,0,0,1,0,0,0,0,1,0,0,0,0,0,0,0,0,0
2,1,1,7,0,0,1.0,0,1,0.0,0.0,2.0,1.0,1,1,0,0,0,0,0,1,0,1,0,0,0,0,0,0,0,0,0
2,2,1,131,0,0,3.0,0,1,,,2.0,1.0,0,0,1,0,0,0,0,0,0,0,1,0,0,0,0,0,0,0,0
3,1,0,26,1,0,4.0,0,0,,,2.0,0.0,0,0,1,0,0,1,0,0,0,0,0,0,0,0,0,0,0,0,0
2,1,0,5,1,0,1.0,0,1,0.0,0.0,2.0,1.0,0,1,1,1,0,0,0,1,0,0,0,0,0,0,0,0,0,0,0
2,2,0,69,1,0,1.0,0,1,,,2.0,1.0,1,1,1,0,0,0,0,1,0,1,1,1,0,0,0,0,0,0,0
2,1,0,203,1,0,0.0,0,1,0.0,0.0,2.0,1.0,0,1,1,0,1,0,0,0,0,0,0,0,0,0,0,0,0,0,0
0,1,0,211,0,0,1.0,1,1,0.0,0.0,1.0,1.0,0,1,1,0,0,0,0,1,0,0,0,0,0,0,0,0,0,1,0
2,1,1,16,1,0,1.0,0,1,0.0,0.0,2.0,1.0,1,0,0,0,0,0,0,0,0,0,0,1,0,0,0,0,0,0,0
3,2,1,53,1,0,5.0,0,0,,,2.0,0.0,1,0,1,0,0,0,0,0,0,1,0,0,0,0,0,0,0,0,0
2,0,1,10,1,0,1.0,0,1,0.0,0.0,2.0,1.0,1,1,0,0,1,0,1,1,0,1,0,0,0,0,0,0,0,0,0
3,1,1,208,0,0,6.0,0,0,0.0,0.0,2.0,0.0,0,0,1,0,0,0,0,0,0,0,0,0,0,1,0,0,0,0,0
2,2,1,10,1,0,1.0,0,1,0.0,0.0,2.0,1.0,0,1,0,0,0,0,0,0,0,0,0,0,0,0,0,0,0,0,0
2,2,0,73,0,0,1.0,0,1,,,2.0,1.0,1,1,1,1,0,0,0,1,0,1,0,0,0,0,0,0,0,0,0
2,1,0,71,1,0,1.0,0,1,0.0,0.0,2.0,1.0,1,0,1,0,0,0,0,0,0,1,1,1,0,0,0,0,0,0,0
2,2,1,12,1,0,4.0,0,1,,,3.0,1.0,0,0,1,0,0,0,0,0,0,0,0,0,0,0,0,0,0,0,0
2,1,1,197,0,0,0.0,0,1,,,2.0,1.0,0,1,0,0,1,0,0,1,0,0,0,0,0,0,0,0,0,0,0
2,0,1,9,0,0,1.0,0,1,0.0,0.0,2.0,1.0,1,1,0,0,1,0,1,1,1,0,0,0,0,0,0,0,0,0,0
2,0,1,13,0,0,1.0,0,1,0.0,0.0,2.0,1.0,0,1,1,0,1,0,1,1,0,0,0,0,0,0,0,0,0,0,0
2,2,1,11,0,0,1.0,0,1,0.0,0.0,2.0,1.0,1,1,0,0,0,0,0,1,0,1,0,0,0,0,0,0,0,0,0
2,2,0,120,0,0,0.0,0,1,,,2.0,1.0,0,1,0,0,1,0,0,1,0,0,0,0,0,0,0,0,0,0,0
1,2,1,23,1,0,4.0,1,0,,,2.0,0.0,0,0,1,0,0,1,0,0,0,0,0,0,0,0,0,0,0,0,0
3,2,0,18,1,0,5.0,0,0,,,2.0,0.0,1,0,0,0,0,0,0,0,0,1,0,0,0,0,0,0,0,0,0
2,1,1,142,0,0,0.0,0,1,0.0,0.0,1.0,1.0,0,1,0,0,1,0,0,0,0,0,0,0,0,0,0,0,0,0,0
2,2,0,174,0,0,3.0,0,1,,,1.0,0.0,0,1,1,0,1,0,0,1,0,0,1,0,0,0,0,0,0,0,0
2,2,0,33,1,0,7.0,0,1,0.0,0.0,2.0,1.0,0,0,1,0,0,0,0,0,0,0,0,0,0,0,0,0,0,0,0
2,2,1,138,0,0,0.0,0,1,0.0,0.0,2.0,1.0,0,1,0,0,1,0,0,1,0,0,0,0,0,0,0,0,0,0,0
2,1,0,213,1,0,7.0,0,1,,,2.0,1.0,0,0,1,0,0,0,0,0,0,0,0,0,0,0,0,0,0,0,0
2,1,0,129,0,0,1.0,0,1,0.0,0.0,1.0,1.0,0,1,0,0,1,0,1,1,0,0,0,0,0,0,0,0,0,0,0
2,1,0,79,0,0,1.0,0,1,0.0,0.0,2.0,1.0,0,1,1,1,0,0,0,1,0,0,0,0,0,0,0,0,0,0,0
2,1,1,4,1,0,1.0,0,1,0.0,0.0,2.0,1.0,0,0,0,0,0,0,0,0,0,0,0,0,0,0,0,0,0,0,0
2,2,0,31,0,0,3.0,0,1,,,2.0,1.0,0,0,1,0,0,0,0,0,0,0,1,0,0,0,0,0,0,0,0
2,1,1,38,0,0,0.0,0,1,,,2.0,1.0,0,1,1,0,0,0,1,1,0,0,1,0,0,0,0,0,0,0,0
2,2,1,11,1,0,1.0,0,1,,,2.0,1.0,1,0,0,0,0,0,0,0,0,1,0,1,0,0,0,0,0,0,0
2,1,0,113,1,0,7.0,0,1,,,2.0,1.0,0,1,1,0,0,0,0,1,0,0,1,0,0,0,0,0,0,0,0
2,1,0,43,0,0,1.0,0,1,0.0,0.0,2.0,1.0,0,1,1,1,0,0,0,1,0,0,1,0,0,0,0,0,0,0,0
2,1,0,43,0,0,1.0,0,1,0.0,0.0,1.0,1.0,0,1,1,0,0,0,1,0,0,0,1,0,0,0,0,0,0,0,0
2,2,1,14,0,0,1.0,0,1,0.0,0.0,2.0,1.0,0,1,1,1,0,0,0,1,0,0,0,0,0,0,0,0,0,0,0
2,2,1,43,0,0,0.0,0,1,,,1.0,1.0,1,1,1,0,0,0,0,1,0,0,0,0,0,0,0,1,0,0,0
2,1,0,56,0,0,0.0,0,1,0.0,0.0,2.0,1.0,0,1,1,0,0,0,0,1,0,0,1,0,0,0,0,0,0,0,0
2,2,1,13,1,0,1.0,0,1,,,2.0,1.0,1,0,0,0,0,0,0,0,0,0,0,1,0,0,0,0,0,0,0
3,2,1,92,1,0,1.0,0,0,,,2.0,0.0,1,0,1,0,0,0,0,0,0,1,1,1,0,0,0,0,0,0,0
2,1,1,20,1,0,3.0,0,1,0.0,0.0,1.0,1.0,1,1,0,0,0,0,0,1,0,1,0,0,0,0,0,0,0,0,0
2,2,0,69,0,0,0.0,0,1,,,1.0,1.0,1,1,0,0,1,0,0,1,0,0,0,0,0,0,0,0,0,0,0
2,2,0,9,0,0,1.0,0,1,,,2.0,1.0,0,0,1,0,0,0,0,0,0,0,0,0,0,0,0,0,1,0,0
2,1,0,10,0,0,1.0,0,1,0.0,0.0,2.0,1.0,0,1,0,0,0,0,0,1,0,0,0,0,0,0,0,0,0,0,0
2,2,0,77,0,0,6.0,0,1,,,2.0,1.0,0,0,1,0,0,0,0,0,0,0,0,0,0,0,0,0,0,0,0
2,2,0,22,1,0,1.0,0,1,0.0,0.0,1.0,1.0,0,1,1,1,0,0,0,1,0,0,0,0,0,0,0,0,1,0,0
2,1,0,19,1,0,0.0,0,1,0.0,0.0,2.0,1.0,0,1,0,0,0,0,0,1,0,0,0,0,0,0,0,0,0,0,0
2,1,0,24,0,0,1.0,0,1,0.0,0.0,2.0,1.0,1,1,0,0,1,0,0,1,0,1,0,0,0,0,0,0,0,0,0
2,2,0,26,0,0,1.0,0,1,0.0,0.0,2.0,1.0,1,0,1,0,0,0,0,0,0,0,1,1,0,0,0,0,0,0,0
3,2,0,95,1,0,6.0,0,0,,,2.0,0.0,0,0,1,0,0,0,0,0,0,0,0,0,0,1,0,0,0,0,0
2,1,0,8,1,0,1.0,0,1,0.0,0.0,2.0,1.0,1,0,0,0,0,0,0,0,0,1,0,1,0,0,0,0,0,0,0
0,0,0,56,0,0,0.0,1,1,0.0,0.0,2.0,1.0,0,1,0,0,0,0,0,1,0,0,0,0,0,0,0,0,0,0,0
2,1,1,79,0,0,1.0,0,1,0.0,0.0,2.0,1.0,1,1,1,0,0,0,0,1,0,0,1,1,0,0,0,0,0,0,0
2,1,1,78,0,0,0.0,0,1,0.0,0.0,2.0,1.0,0,1,0,0,0,0,0,1,0,0,0,0,0,0,0,0,0,0,0
0,0,1,10,0,0,0.0,1,1,,,2.0,1.0,0,1,0,0,1,0,1,1,0,0,0,0,0,0,0,0,0,0,0
2,1,1,43,0,0,0.0,0,1,0.0,0.0,2.0,1.0,1,1,1,0,0,0,0,1,0,1,1,0,0,0,0,0,0,0,0
2,1,1,16,1,0,1.0,0,1,0.0,0.0,2.0,1.0,1,0,0,0,0,0,0,0,0,0,0,0,0,0,0,0,0,0,0
2,2,0,80,1,0,3.0,0,1,0.0,0.0,2.0,1.0,1,0,1,0,0,0,0,0,0,1,1,0,0,0,0,0,0,1,0
2,1,1,19,1,0,1.0,0,1,0.0,0.0,2.0,1.0,0,1,0,0,1,0,0,1,0,0,0,0,0,0,0,0,0,0,0
2,1,0,123,0,0,6.0,0,1,0.0,0.0,1.0,1.0,1,1,1,0,0,0,0,1,0,0,1,1,0,1,0,0,0,0,0
3,2,0,81,1,0,5.0,0,0,,,2.0,0.0,1,0,1,0,0,0,0,0,0,1,0,0,0,0,0,0,0,0,0
2,2,1,26,0,0,0.0,0,1,,,1.0,1.0,0,1,1,0,0,0,0,1,0,0,0,0,0,0,0,0,0,0,0
2,2,1,57,0,0,1.0,0,1,,,2.0,1.0,0,1,1,0,0,0,0,1,0,0,0,0,0,0,0,0,0,0,0
2,2,0,18,1,0,1.0,0,1,0.0,0.0,2.0,1.0,1,1,0,0,0,0,0,1,0,1,0,0,0,0,0,0,0,0,0
2,1,1,32,1,0,1.0,0,1,0.0,0.0,2.0,1.0,0,1,1,0,0,0,0,1,0,0,1,0,0,0,0,0,0,0,0
2,2,1,150,0,0,1.0,0,1,,,2.0,1.0,1,0,1,0,0,0,0,0,0,0,1,1,0,0,0,0,0,0,0
2,2,0,13,0,0,1.0,0,1,,,2.0,1.0,0,1,0,0,0,0,0,1,0,0,0,0,0,0,0,0,0,0,0
2,1,1,87,0,0,1.0,0,1,,,2.0,1.0,0,1,0,0,0,0,0,1,0,0,0,0,0,0,0,0,0,0,0
2,2,1,11,0,0,1.0,0,1,0.0,0.0,1.0,1.0,0,1,1,0,0,0,0,0,0,0,0,0,0,0,0,0,1,0,0
2,0,0,9,0,0,1.0,0,1,0.0,0.0,2.0,1.0,0,1,0,0,0,0,0,1,0,0,0,0,0,0,0,0,0,0,0
2,1,0,12,1,0,1.0,0,1,0.0,0.0,2.0,1.0,0,0,1,1,1,0,0,0,0,0,0,0,0,0,0,0,1,0,0
2,1,1,117,0,0,1.0,0,1,,,1.0,1.0,0,1,0,0,0,0,0,1,0,0,0,0,0,0,0,0,0,0,0
2,1,1,33,0,0,1.0,0,1,0.0,0.0,2.0,1.0,0,1,1,1,0,0,0,0,0,0,0,0,0,0,0,0,0,1,0
2,2,0,53,0,0,0.0,0,1,0.0,0.0,2.0,0.0,0,1,0,0,1,0,0,0,1,0,0,0,0,0,0,0,0,0,0
2,1,1,6,1,0,7.0,0,1,0.0,0.0,2.0,1.0,1,0,0,0,0,0,0,0,0,0,0,0,0,0,0,0,0,0,0
2,1,1,89,0,0,1.0,0,1,0.0,0.0,2.0,1.0,0,1,1,0,0,0,0,1,0,0,1,0,0,0,0,0,0,0,0
2,1,1,8,0,0,1.0,0,1,0.0,0.0,2.0,1.0,0,1,0,0,0,0,0,1,0,0,0,0,0,0,0,0,0,0,0
2,2,1,144,0,0,1.0,0,1,,,2.0,1.0,0,0,1,0,0,0,0,0,0,0,0,0,1,0,0,0,0,1,0
3,2,1,80,1,0,5.0,0,0,,,2.0,0.0,1,0,0,0,0,0,0,0,0,1,0,0,0,0,0,0,0,0,0
2,2,0,12,0,0,3.0,0,1,,,2.0,1.0,0,1,1,1,0,0,0,1,0,0,0,0,0,0,0,0,0,0,0
2,1,1,10,0,0,1.0,0,1,0.0,0.0,2.0,1.0,0,0,0,0,0,0,0,0,0,0,0,0,0,0,0,0,0,0,0
2,1,0,74,1,0,0.0,0,1,,,2.0,1.0,0,1,0,0,1,0,0,1,0,0,0,0,0,0,0,0,0,0,0
2,1,0,6,1,0,1.0,0,1,0.0,0.0,2.0,1.0,0,1,0,0,0,0,0,1,0,0,0,0,0,0,0,0,0,0,0
2,1,1,10,0,0,1.0,0,1,0.0,0.0,2.0,1.0,0,1,0,0,0,0,0,1,0,0,0,0,0,0,0,0,0,0,0
3,1,0,25,1,0,6.0,0,0,,,2.0,0.0,0,0,1,0,0,0,0,0,0,0,0,0,0,0,0,0,0,0,0
2,1,1,38,1,0,1.0,0,1,,,2.0,1.0,1,0,1,0,0,0,0,0,0,0,1,1,0,0,0,0,0,0,0
0,1,0,54,0,0,1.0,1,1,0.0,0.0,2.0,1.0,0,1,1,0,0,0,0,1,0,0,0,0,0,0,0,0,0,1,0
2,2,0,11,0,0,1.0,0,1,0.0,0.0,2.0,1.0,0,0,0,0,0,0,0,0,0,0,0,0,0,0,0,0,0,0,0
2,2,1,12,1,0,1.0,0,1,0.0,0.0,2.0,1.0,0,1,0,0,0,0,0,1,0,0,0,0,0,0,0,0,0,0,0
2,2,1,121,0,0,1.0,0,1,,,2.0,1.0,0,1,1,0,0,0,0,1,0,0,0,0,0,0,0,0,0,0,0
0,0,0,149,0,0,0.0,1,1,1.0,0.0,2.0,1.0,0,1,0,0,1,0,1,1,0,0,0,0,0,0,0,0,0,0,0
2,2,0,15,1,0,1.0,0,1,0.0,0.0,2.0,1.0,0,1,1,0,0,0,0,1,0,0,0,0,0,0,0,1,1,0,0
2,1,0,7,1,0,1.0,0,1,0.0,0.0,2.0,1.0,0,0,0,0,0,0,0,0,0,0,0,0,0,0,0,0,0,0,0
2,1,1,1,0,0,1.0,0,1,0.0,0.0,2.0,1.0,0,1,1,1,0,0,1,1,0,0,0,0,0,0,0,0,0,0,0
2,1,0,199,1,0,0.0,0,1,0.0,0.0,2.0,0.0,0,0,1,0,1,0,0,0,1,0,0,0,0,1,0,0,0,0,0
2,1,1,19,1,0,3.0,0,1,0.0,0.0,2.0,1.0,1,0,0,0,0,0,0,0,0,1,0,0,0,0,0,0,0,0,0
0,1,0,53,0,1,2.0,1,1,0.0,0.0,2.0,1.0,1,1,1,0,0,0,0,1,0,1,1,1,0,0,0,0,0,0,0
2,1,0,66,1,0,1.0,0,1,0.0,0.0,2.0,1.0,0,1,1,0,0,0,0,1,0,0,0,0,0,1,0,0,0,0,0
2,2,0,104,0,0,1.0,0,1,,,2.0,1.0,1,0,1,0,0,0,0,0,0,1,1,1,0,0,0,0,0,0,0
2,2,0,22,0,0,1.0,0,1,0.0,0.0,1.0,1.0,0,1,1,0,0,0,0,1,0,0,0,0,0,0,0,0,0,0,0
0,2,0,173,1,0,6.0,1,1,,,2.0,1.0,0,1,1,0,1,0,0,0,0,0,0,0,0,0,0,0,0,1,0
2,2,1,10,1,0,1.0,0,1,,,2.0,1.0,0,0,1,0,0,0,0,0,0,0,0,0,0,0,0,0,0,0,0
2,2,1,71,0,0,0.0,0,1,0.0,0.0,1.0,0.0,0,1,0,0,1,0,0,1,0,0,0,0,0,0,0,0,0,0,0
2,2,1,151,1,0,0.0,0,1,,,2.0,1.0,0,1,1,0,0,0,0,1,0,0,0,0,0,0,0,0,0,0,0
3,0,0,62,1,0,0.0,0,0,,,1.0,0.0,0,1,0,0,0,0,0,1,0,0,0,0,0,0,0,0,0,0,0
2,2,1,142,0,0,0.0,0,1,,,2.0,1.0,0,1,1,0,0,0,0,1,0,0,0,0,0,0,0,0,0,1,0
2,2,1,16,1,0,3.0,0,1,,,2.0,1.0,1,0,0,0,0,0,0,0,0,1,0,0,0,0,0,0,0,0,0
2,1,1,42,1,0,1.0,0,1,0.0,0.0,1.0,1.0,1,0,1,0,0,1,0,0,0,1,1,1,0,0,0,0,0,0,0
2,1,0,142,1,0,0.0,0,1,0.0,0.0,2.0,1.0,1,1,1,0,0,0,1,1,0,1,1,0,0,0,0,0,0,0,0
2,2,1,131,1,0,1.0,0,1,0.0,0.0,2.0,1.0,1,0,1,0,0,0,0,0,0,1,1,0,0,0,0,1,0,1,0
2,1,0,206,1,0,7.0,0,1,0.0,0.0,2.0,1.0,1,0,1,0,0,0,0,0,0,1,1,0,1,1,0,1,0,0,0
2,2,1,8,0,0,1.0,0,1,,,2.0,1.0,0,1,0,0,0,0,0,1,0,0,0,0,0,0,0,0,0,0,0
1,2,1,96,1,0,0.0,1,0,,,2.0,0.0,0,1,0,0,0,0,0,1,0,0,0,0,0,0,0,0,0,0,0
2,1,0,166,0,0,6.0,0,1,0.0,0.0,2.0,1.0,0,1,1,0,0,0,0,1,0,0,0,0,1,1,0,0,0,0,0
1,2,1,123,1,0,3.0,1,0,0.0,0.0,2.0,0.0,1,0,1,0,0,0,0,0,0,1,1,0,0,0,0,0,0,0,0
2,1,0,25,1,0,0.0,0,1,0.0,0.0,2.0,1.0,0,0,0,0,1,0,0,0,1,0,0,0,0,0,0,0,0,0,0
2,1,0,12,1,0,1.0,0,1,0.0,0.0,2.0,1.0,1,0,0,0,0,0,0,0,0,0,0,1,0,0,0,0,0,0,0
3,2,1,173,0,0,6.0,0,0,,,1.0,0.0,0,0,1,0,0,0,0,0,0,0,0,0,0,0,0,0,0,0,0
2,1,0,30,0,0,1.0,0,1,,,2.0,1.0,1,0,0,0,0,0,0,0,0,1,0,1,0,0,0,0,0,0,0
0,2,1,12,0,0,1.0,1,1,,,1.0,1.0,1,1,0,0,0,0,0,1,0,0,0,0,0,0,0,0,0,0,0
2,1,1,26,0,0,1.0,0,1,0.0,0.0,2.0,1.0,0,1,1,1,1,0,1,1,0,0,0,0,0,0,0,0,0,0,0
0,2,1,108,0,0,6.0,1,1,0.0,0.0,2.0,1.0,0,0,1,0,0,0,0,0,0,0,1,0,0,0,0,0,0,1,0
3,2,1,155,1,0,6.0,0,0,,,2.0,0.0,0,0,1,0,0,0,0,0,0,0,0,0,0,0,0,0,0,1,0
2,2,1,78,0,0,0.0,0,1,0.0,0.0,2.0,1.0,0,1,1,0,0,0,0,1,0,0,1,0,0,0,0,0,0,0,0
2,2,0,6,0,0,1.0,0,1,0.0,0.0,1.0,1.0,0,0,1,1,0,0,0,0,0,0,0,0,0,0,0,0,0,0,0
0,0,1,15,1,0,0.0,1,1,,,2.0,1.0,1,1,0,0,1,0,0,1,1,1,0,0,0,0,0,0,0,0,0
0,1,0,96,0,0,1.0,1,1,0.0,0.0,2.0,1.0,1,0,0,0,0,0,0,0,0,1,0,1,0,0,0,0,0,0,0
2,2,0,12,1,0,1.0,0,1,,,2.0,1.0,0,1,1,0,0,0,0,1,0,0,0,0,0,0,0,0,0,0,0
0,1,1,142,1,0,0.0,1,1,0.0,0.0,2.0,1.0,0,1,1,0,1,0,0,1,0,0,1,0,0,0,0,0,0,1,0
2,2,0,9,0,0,0.0,0,1,0.0,0.0,1.0,1.0,0,1,0,0,0,0,0,1,0,0,0,0,0,0,0,0,0,0,0
2,2,0,20,1,0,1.0,0,1,,,2.0,1.0,0,1,0,0,0,0,0,1,0,0,0,0,0,0,0,0,0,0,0
2,2,1,106,1,0,1.0,0,1,,,2.0,1.0,1,0,1,0,0,0,0,0,0,1,1,1,0,0,0,0,0,0,0
3,1,0,70,1,0,4.0,0,0,,,2.0,0.0,1,0,1,0,0,0,0,0,0,1,0,0,0,0,0,0,0,0,0
2,1,1,15,1,0,4.0,0,1,0.0,0.0,2.0,1.0,1,0,1,0,0,1,0,0,0,1,0,0,0,0,0,0,0,0,0
2,2,1,7,0,0,1.0,0,1,0.0,0.0,2.0,1.0,0,1,0,0,0,0,0,1,0,0,0,0,0,0,0,0,0,0,0
3,2,0,5,1,0,5.0,0,0,,,1.0,0.0,0,0,1,0,0,0,0,0,0,0,0,0,0,0,0,0,0,0,0
0,0,1,32,0,0,0.0,1,1,0.0,0.0,2.0,1.0,1,1,1,0,0,0,1,1,0,1,0,0,0,0,0,1,0,0,0
2,0,0,208,1,0,0.0,0,1,0.0,0.0,2.0,1.0,0,1,0,0,1,0,0,1,1,0,0,0,0,0,0,0,0,0,0
3,2,1,110,1,0,4.0,0,0,,,1.0,0.0,0,0,1,0,0,0,0,0,0,0,0,0,0,0,0,0,0,0,0
2,2,0,126,1,0,3.0,0,1,,,2.0,1.0,1,0,1,0,0,0,0,0,0,1,1,0,0,0,0,0,0,0,0
2,1,1,8,1,0,1.0,0,1,0.0,0.0,2.0,1.0,1,1,0,0,0,0,0,1,0,1,0,1,0,0,0,0,0,0,0
2,2,1,110,1,0,1.0,0,1,0.0,0.0,2.0,1.0,0,1,1,0,0,0,0,1,0,0,0,0,0,0,0,0,0,0,0
2,1,0,130,0,0,3.0,0,1,,,2.0,1.0,1,0,1,0,0,0,0,0,0,1,1,0,0,0,0,0,0,0,0
2,2,1,17,1,0,1.0,0,1,0.0,0.0,2.0,1.0,0,1,1,0,0,0,0,1,0,0,0,0,0,0,0,0,0,0,0
2,1,0,8,1,0,1.0,0,1,0.0,0.0,1.0,1.0,0,0,0,0,0,0,0,0,0,0,0,0,0,0,0,0,0,0,0
2,2,0,165,1,0,1.0,0,1,0.0,0.0,2.0,1.0,0,1,0,0,1,0,0,1,0,0,0,0,0,0,0,0,0,0,0
0,0,1,82,0,0,0.0,1,1,1.0,0.0,2.0,1.0,0,1,0,0,1,0,1,1,0,0,0,0,0,0,0,0,0,0,0
2,2,1,137,1,0,0.0,0,1,0.0,0.0,1.0,1.0,0,1,1,0,1,0,0,1,0,0,0,0,0,0,0,0,0,1,0
2,2,1,47,1,0,1.0,0,1,0.0,0.0,2.0,1.0,0,0,1,0,0,0,0,0,0,0,0,0,0,0,0,0,0,0,0
0,2,0,7,0,0,1.0,1,1,0.0,0.0,2.0,1.0,0,1,0,0,0,0,0,1,0,0,0,0,0,0,0,0,0,0,0
2,2,0,20,1,0,1.0,0,1,,,2.0,1.0,1,0,0,0,0,0,0,0,0,0,0,1,0,0,0,0,0,0,0
2,2,1,8,1,0,1.0,0,1,0.0,0.0,2.0,1.0,0,1,1,1,0,0,1,1,1,0,0,0,0,0,0,0,0,0,0
2,2,0,65,0,0,0.0,0,1,,,1.0,1.0,0,1,1,0,0,0,0,1,0,0,1,0,0,0,0,0,0,0,0
3,1,1,125,1,0,4.0,0,0,,,1.0,0.0,1,0,1,0,0,0,0,0,0,1,0,0,0,0,0,0,0,1,0
2,2,1,17,1,0,1.0,0,1,0.0,0.0,2.0,1.0,1,1,0,0,0,0,0,1,0,0,0,1,0,0,0,0,0,0,0
2,1,1,13,1,0,3.0,0,1,0.0,0.0,2.0,1.0,0,1,1,0,0,0,0,1,0,0,0,0,0,0,0,0,0,0,0
2,1,1,8,1,0,1.0,0,1,0.0,0.0,2.0,1.0,0,1,1,0,0,0,0,1,0,0,0,0,0,0,0,0,0,0,0
2,1,1,91,0,0,1.0,0,1,,,2.0,1.0,0,1,0,0,1,0,0,1,0,0,0,0,0,0,0,0,0,0,0
0,0,0,11,0,0,1.0,1,1,0.0,0.0,2.0,1.0,0,1,0,0,0,0,1,0,0,0,0,0,0,0,0,0,0,0,0
2,2,0,1,1,0,0.0,0,1,,,2.0,1.0,1,1,0,0,1,0,0,1,1,0,0,0,0,0,0,0,0,0,0
2,1,1,137,1,0,6.0,0,1,,,1.0,0.0,0,0,1,0,0,0,0,0,1,0,1,0,0,0,0,0,0,1,0
0,1,1,8,1,0,1.0,1,1,0.0,0.0,2.0,1.0,0,1,0,0,1,0,1,1,0,0,0,0,0,0,0,0,0,0,0
3,1,1,95,1,0,4.0,0,0,,,2.0,0.0,0,0,1,0,0,0,0,0,0,0,0,0,0,0,0,0,0,0,0
0,1,0,17,0,0,0.0,1,1,0.0,0.0,2.0,1.0,0,1,0,0,0,0,0,1,0,0,0,0,0,0,0,0,0,0,0
2,2,1,9,1,0,6.0,0,1,,,2.0,1.0,0,0,0,0,0,0,0,0,0,0,0,0,0,0,0,0,0,0,0
2,2,1,8,0,0,1.0,0,1,,,2.0,1.0,1,1,1,0,0,0,0,1,0,0,0,0,0,0,0,0,0,0,0
2,1,0,23,1,0,1.0,0,1,0.0,0.0,2.0,1.0,1,1,1,1,0,0,0,1,0,0,0,0,0,0,0,0,0,0,0
2,2,0,13,1,0,1.0,0,1,,,2.0,1.0,0,1,1,0,0,0,0,1,0,0,0,0,0,0,0,0,0,0,0
2,2,0,117,0,0,1.0,0,1,,,2.0,1.0,0,1,1,0,1,0,0,1,0,0,1,0,0,0,0,0,0,1,0
2,2,1,12,1,0,1.0,0,1,0.0,0.0,2.0,1.0,1,0,1,0,0,0,0,0,0,0,0,1,0,0,0,0,1,0,0
2,2,0,3,1,0,1.0,0,1,,,2.0,1.0,0,0,1,0,0,0,0,0,0,0,0,0,0,0,0,0,0,0,0
2,2,0,18,1,0,1.0,0,1,,,2.0,1.0,1,1,0,0,0,0,0,1,0,0,0,1,0,0,0,0,0,0,0
0,0,0,152,0,1,2.0,1,1,0.0,0.0,2.0,1.0,1,1,0,0,1,0,0,0,0,0,0,0,0,0,0,0,0,0,0
2,1,1,6,1,0,0.0,0,1,0.0,0.0,2.0,1.0,0,1,1,0,0,0,1,1,0,0,0,0,0,0,0,0,0,0,0
2,2,1,66,0,0,1.0,0,1,0.0,0.0,1.0,1.0,0,1,1,0,0,0,0,1,0,0,0,0,0,0,0,0,0,1,0
3,2,1,160,1,0,6.0,0,0,,,2.0,0.0,0,0,1,0,0,0,0,0,0,0,0,0,0,0,0,0,0,0,0
2,2,1,158,0,0,3.0,0,1,,,2.0,1.0,1,0,1,0,0,0,0,0,0,1,1,0,0,0,0,0,0,0,0
3,2,0,76,0,0,5.0,0,0,,,2.0,0.0,0,0,1,0,0,0,0,0,0,0,0,0,0,0,0,0,0,0,0
2,1,0,48,1,0,1.0,0,1,0.0,0.0,2.0,1.0,0,1,1,0,0,0,0,1,0,0,0,0,0,0,0,0,0,1,0
2,1,0,38,0,0,1.0,0,1,0.0,0.0,1.0,1.0,1,0,1,0,0,0,0,0,0,1,1,0,0,0,0,0,0,0,0
2,1,1,33,0,0,1.0,0,1,0.0,0.0,2.0,1.0,0,1,0,0,0,0,1,1,0,0,0,0,0,0,0,0,0,0,0
2,1,1,103,0,0,1.0,0,1,0.0,0.0,2.0,1.0,0,0,1,0,0,0,0,0,0,0,1,0,0,0,0,0,0,0,0
0,2,1,114,1,0,1.0,1,1,0.0,0.0,2.0,1.0,0,1,1,0,1,0,0,1,0,0,0,0,0,0,0,0,0,1,0
0,0,0,105,1,0,1.0,1,1,0.0,0.0,2.0,1.0,0,1,1,0,1,0,0,1,0,0,0,0,0,0,0,0,0,1,0
2,1,1,44,1,0,1.0,0,1,0.0,0.0,2.0,1.0,0,1,1,0,0,0,0,1,0,0,0,0,0,0,0,0,0,0,0
2,1,1,22,0,0,0.0,0,1,0.0,0.0,2.0,1.0,0,1,0,0,0,0,1,1,0,0,0,0,0,0,0,0,0,0,0
2,2,0,13,0,0,1.0,0,1,,,1.0,1.0,0,1,0,0,0,0,0,1,0,0,0,0,0,0,0,0,0,0,0
1,0,0,80,1,0,6.0,1,0,0.0,0.0,2.0,0.0,0,1,0,0,0,0,1,1,0,0,0,0,0,0,0,0,0,0,0
2,1,0,133,1,0,6.0,0,1,,,2.0,0.0,0,0,1,1,0,0,0,0,1,0,0,0,0,1,0,0,0,1,0
2,1,0,215,0,0,1.0,0,1,0.0,0.0,2.0,1.0,0,1,1,0,0,0,0,1,0,0,0,0,0,0,1,0,0,0,0
0,2,0,176,0,0,1.0,1,1,,,1.0,1.0,0,0,0,0,0,0,0,0,0,0,0,0,0,0,0,0,0,0,0
3,1,1,33,1,0,1.0,0,0,0.0,0.0,2.0,0.0,1,1,0,0,0,0,0,1,0,1,0,1,0,0,0,0,0,0,0
2,2,0,16,1,0,1.0,0,1,0.0,0.0,2.0,1.0,1,1,1,1,0,0,0,1,0,0,0,1,0,0,0,0,1,0,0
2,0,1,15,0,0,1.0,0,1,0.0,0.0,2.0,1.0,0,1,0,0,1,0,0,1,1,0,0,0,0,0,0,0,0,0,0
2,2,0,19,1,0,1.0,0,1,,,2.0,1.0,0,1,0,0,0,0,1,1,0,0,0,0,0,0,0,0,0,0,0
0,0,1,20,0,0,1.0,1,1,0.0,0.0,2.0,1.0,1,1,0,0,0,0,0,1,0,1,0,0,0,0,0,0,0,0,0
2,1,1,183,0,0,1.0,0,1,,,2.0,1.0,0,1,1,1,0,0,0,1,0,0,0,0,0,0,0,0,0,0,0
2,2,1,43,1,0,0.0,0,1,,,2.0,0.0,0,1,1,1,1,0,0,1,1,0,0,0,0,0,0,0,0,0,0
2,2,1,208,0,0,3.0,0,1,,,2.0,1.0,0,0,1,0,0,0,0,0,0,0,1,0,0,0,0,0,0,0,0
2,2,1,25,0,0,1.0,0,1,0.0,0.0,2.0,1.0,0,1,1,0,1,0,1,1,0,0,0,0,0,0,0,0,0,0,0
2,2,1,22,1,0,1.0,0,1,0.0,0.0,2.0,1.0,1,1,0,0,1,0,1,1,0,1,0,0,0,0,0,0,0,0,0
2,1,0,20,1,0,1.0,0,1,0.0,0.0,3.0,1.0,1,1,0,0,0,0,0,1,0,1,0,0,0,0,0,0,0,0,0
2,1,1,8,0,0,1.0,0,1,0.0,0.0,2.0,1.0,0,1,1,0,0,0,0,0,0,0,0,0,0,0,0,0,1,0,0
2,1,0,11,0,0,1.0,0,1,0.0,0.0,2.0,1.0,1,1,0,0,0,0,0,1,0,0,0,1,0,0,0,0,0,0,0
2,2,0,142,1,0,3.0,0,1,0.0,0.0,2.0,1.0,1,0,1,0,0,0,0,0,0,0,1,0,0,0,0,0,0,0,0
2,1,0,73,0,0,0.0,0,1,0.0,0.0,2.0,1.0,0,1,0,0,0,0,0,1,0,0,0,0,0,0,0,0,0,0,0
2,1,1,113,1,0,1.0,0,1,,,2.0,1.0,1,1,0,0,0,0,0,1,0,1,0,1,0,0,0,0,0,0,0
2,2,1,60,1,0,1.0,0,1,0.0,0.0,2.0,1.0,0,1,1,0,0,0,0,1,0,0,0,0,0,0,0,0,0,0,0
2,2,0,68,0,0,1.0,0,1,,,2.0,1.0,0,1,1,0,0,0,0,1,0,0,0,0,1,0,0,0,0,1,0
2,0,0,10,1,0,1.0,0,1,0.0,0.0,2.0,1.0,0,1,0,0,0,0,0,1,0,0,0,0,0,0,0,0,0,0,0
2,2,0,34,0,0,0.0,0,1,,,2.0,1.0,0,1,0,0,0,0,0,1,0,0,0,0,0,0,0,0,0,0,0
2,1,0,81,0,0,0.0,0,1,0.0,0.0,2.0,1.0,0,1,0,0,0,0,0,1,1,0,0,0,0,0,0,0,0,0,0
0,0,0,37,0,0,0.0,1,1,0.0,0.0,1.0,0.0,0,1,0,0,1,0,1,0,0,0,0,0,0,0,0,0,0,0,0
2,2,1,29,0,0,3.0,0,1,,,2.0,1.0,1,0,0,0,0,0,0,0,0,1,0,0,0,0,0,0,0,0,0
2,1,0,13,0,0,1.0,0,1,0.0,0.0,2.0,1.0,0,1,0,0,0,0,1,1,0,0,0,0,0,0,0,0,0,0,0
2,2,1,9,1,0,1.0,0,1,,,2.0,1.0,1,1,0,0,0,0,0,1,0,0,0,0,0,0,0,0,0,0,0
2,1,1,179,0,0,1.0,0,1,0.0,0.0,2.0,1.0,0,1,1,0,0,0,0,1,0,0,0,0,0,1,0,0,0,1,0
2,2,0,201,0,0,1.0,0,1,,,2.0,1.0,0,1,1,0,0,0,0,1,0,0,0,0,0,0,0,0,0,0,0
2,2,0,33,0,0,0.0,0,1,,,2.0,1.0,0,1,0,0,0,0,0,1,0,0,0,0,0,0,0,0,0,0,0
2,2,1,22,1,0,1.0,0,1,,,2.0,1.0,0,1,0,0,0,0,0,1,0,0,0,0,0,0,0,0,0,0,0
2,2,1,14,1,0,1.0,0,1,0.0,0.0,2.0,1.0,1,0,0,0,0,0,0,0,0,1,0,0,0,0,0,0,0,0,0
2,1,1,65,1,0,1.0,0,1,0.0,0.0,2.0,1.0,1,1,1,0,0,0,0,1,0,1,0,0,0,0,0,0,0,1,0
2,2,1,58,0,0,0.0,0,1,,,2.0,1.0,0,1,0,0,0,0,0,1,0,0,0,0,0,0,0,0,0,0,0
0,0,1,18,0,0,0.0,1,1,0.0,0.0,2.0,1.0,1,1,0,0,1,0,1,1,0,0,0,0,0,0,0,0,0,0,0
2,2,0,20,1,0,1.0,0,1,0.0,0.0,2.0,1.0,0,1,0,0,0,0,0,1,0,0,0,0,0,0,0,0,0,0,0
2,1,1,37,1,0,0.0,0,1,0.0,0.0,1.0,1.0,0,1,0,0,0,0,1,0,0,0,0,0,0,0,0,0,0,0,0
3,2,0,7,0,0,6.0,0,0,,,1.0,0.0,1,0,1,0,0,0,0,0,0,1,0,0,0,0,0,0,0,0,0
2,2,1,9,1,0,1.0,0,1,0.0,0.0,2.0,1.0,0,1,1,0,0,0,0,1,0,0,0,0,0,0,0,0,1,0,0
2,1,0,168,1,0,6.0,0,1,0.0,0.0,2.0,1.0,0,0,1,0,0,0,0,0,0,0,0,0,0,0,0,0,0,0,0
2,1,1,75,0,0,1.0,0,1,0.0,0.0,1.0,1.0,1,0,0,0,0,0,0,0,0,0,0,1,0,0,0,0,0,0,0
2,2,0,21,0,0,1.0,0,1,0.0,0.0,2.0,1.0,0,1,0,0,0,0,0,1,0,0,0,0,0,0,0,0,0,0,0
2,2,0,19,0,0,1.0,0,1,0.0,0.0,2.0,1.0,0,0,1,0,0,0,0,0,0,0,0,0,0,0,0,0,0,0,0
2,2,0,26,1,0,1.0,0,1,0.0,0.0,2.0,1.0,1,0,0,0,0,0,0,0,0,0,0,1,0,0,0,0,0,0,0
2,2,1,188,1,0,1.0,0,1,0.0,0.0,2.0,1.0,1,0,1,0,0,0,0,0,0,0,1,1,0,0,0,0,0,1,0
0,0,0,17,0,0,0.0,1,1,0.0,1.0,2.0,1.0,0,1,0,0,1,0,1,1,0,0,0,0,0,0,0,0,0,0,0
2,1,1,136,1,0,3.0,0,1,0.0,0.0,2.0,1.0,0,0,1,0,0,0,0,0,0,0,1,0,0,0,0,0,0,0,0
2,1,0,27,1,0,1.0,0,1,0.0,0.0,1.0,1.0,0,1,1,0,0,0,0,1,0,0,0,0,0,0,0,0,0,0,0
3,1,0,108,0,0,6.0,0,0,,,1.0,0.0,0,0,0,0,0,0,0,0,0,0,0,0,0,0,0,0,0,0,0
2,2,1,188,1,0,1.0,0,1,,,2.0,1.0,0,1,1,0,0,0,0,1,0,0,0,0,0,0,0,0,0,0,0
2,1,1,16,0,0,0.0,0,1,0.0,0.0,2.0,1.0,0,1,0,0,0,0,0,1,0,0,0,0,0,0,0,0,0,0,0
2,1,1,16,0,0,1.0,0,1,0.0,0.0,2.0,1.0,0,1,1,0,0,0,0,1,0,0,0,0,0,0,0,0,0,0,0
2,1,0,163,0,0,1.0,0,1,0.0,0.0,2.0,1.0,0,1,1,0,1,0,0,1,0,0,0,0,0,0,0,0,0,0,0
2,1,1,90,0,0,1.0,0,1,0.0,0.0,2.0,1.0,0,1,1,0,0,0,0,1,0,0,0,0,0,0,0,0,0,1,0
2,2,1,17,1,0,1.0,0,1,0.0,0.0,2.0,1.0,1,0,1,0,0,0,0,0,0,0,1,1,0,0,0,0,0,0,0
2,0,1,86,1,0,1.0,0,1,0.0,0.0,2.0,1.0,1,0,1,1,0,0,0,0,0,1,1,0,0,0,0,0,0,0,0
2,2,0,178,1,0,1.0,0,1,,,2.0,1.0,0,1,0,0,1,0,0,1,0,0,0,0,0,0,0,0,0,0,0
2,2,0,12,1,0,1.0,0,1,0.0,0.0,2.0,1.0,1,0,0,0,0,0,0,0,0,1,0,0,0,0,0,0,0,0,0
2,1,0,68,0,0,0.0,0,1,0.0,0.0,1.0,1.0,1,1,1,0,0,0,0,1,0,1,1,0,0,0,0,0,0,0,0
3,2,0,14,0,0,1.0,0,0,,,2.0,0.0,1,0,1,0,0,0,0,0,0,0,1,1,0,0,0,0,0,0,0
2,1,0,6,1,0,0.0,0,1,0.0,0.0,2.0,1.0,1,1,0,0,1,0,0,0,0,0,0,0,0,0,0,0,0,0,0
3,1,0,10,1,0,4.0,0,0,,,2.0,0.0,0,0,1,0,0,1,0,0,0,0,0,0,0,0,0,0,0,0,0
2,2,0,37,0,0,0.0,0,1,,,2.0,1.0,1,1,0,0,0,0,0,1,0,1,0,0,0,0,0,0,0,0,0
2,1,0,47,1,0,1.0,0,1,0.0,0.0,2.0,1.0,1,0,1,0,0,0,0,0,0,1,0,0,0,0,0,0,0,0,0
2,1,0,184,0,0,0.0,0,1,0.0,0.0,2.0,1.0,0,1,0,0,0,0,0,1,0,0,0,0,0,0,0,0,0,0,0
2,0,1,107,1,0,0.0,0,1,0.0,0.0,2.0,1.0,0,1,1,0,0,0,0,1,0,0,1,0,1,1,0,1,0,1,0
2,2,1,124,0,0,1.0,0,1,,,1.0,1.0,1,0,1,0,0,0,0,0,0,0,1,1,0,0,0,0,0,1,0
0,0,0,35,0,0,1.0,1,1,0.0,0.0,2.0,1.0,0,1,0,0,1,0,0,1,0,0,0,0,0,0,0,0,0,0,0
2,2,1,53,0,0,6.0,0,1,0.0,0.0,2.0,1.0,0,1,1,0,0,0,0,1,0,0,0,0,0,0,0,0,0,0,0
0,1,0,147,0,0,1.0,1,1,0.0,0.0,2.0,1.0,0,1,1,0,0,0,1,1,0,0,0,0,0,0,0,0,0,1,0
2,1,0,24,1,0,7.0,0,1,0.0,0.0,2.0,1.0,0,1,0,0,0,0,0,1,0,0,0,0,0,0,0,0,0,0,0
2,1,0,9,0,0,6.0,0,1,,,1.0,1.0,0,0,1,0,0,0,0,0,0,0,0,0,0,0,0,0,0,0,0
2,2,1,1,1,0,1.0,0,1,,,1.0,1.0,0,1,1,0,0,0,0,1,0,0,0,0,0,0,0,0,1,0,0
3,1,0,100,1,0,6.0,0,0,,,2.0,0.0,0,0,1,0,0,0,0,0,0,0,0,0,0,0,0,0,0,1,0
2,1,0,14,0,0,1.0,0,1,0.0,0.0,2.0,1.0,0,0,1,1,0,0,0,0,0,0,0,0,0,0,0,0,0,0,0
2,1,1,4,1,0,4.0,0,1,0.0,0.0,3.0,1.0,0,1,1,0,0,0,0,1,0,0,0,0,0,0,0,0,1,0,0
2,1,1,131,1,0,1.0,0,1,,,2.0,1.0,1,0,1,0,0,0,0,0,0,1,0,0,0,0,0,0,0,1,0
0,1,0,7,0,0,0.0,1,1,0.0,0.0,1.0,1.0,0,1,0,0,0,0,1,1,0,0,0,0,0,0,0,0,0,0,0
2,2,1,200,0,0,6.0,0,1,,,2.0,1.0,0,0,1,0,0,0,0,0,0,0,0,0,0,0,0,0,0,0,0
2,1,0,10,0,0,1.0,0,1,0.0,0.0,2.0,1.0,0,1,0,0,0,0,0,1,0,0,0,0,0,0,0,0,0,0,0
0,1,0,11,0,0,1.0,1,1,0.0,0.0,2.0,1.0,0,1,0,0,0,0,0,1,0,0,0,0,0,0,0,0,0,0,0
2,1,1,7,0,0,1.0,0,1,0.0,0.0,2.0,1.0,0,0,0,0,0,0,0,0,0,0,0,0,0,0,0,0,0,0,0
2,1,1,9,0,0,1.0,0,1,0.0,0.0,2.0,1.0,0,1,0,0,0,0,0,1,0,0,0,0,0,0,0,0,0,0,0
2,1,0,46,1,0,1.0,0,1,0.0,0.0,2.0,1.0,1,1,0,0,0,0,0,1,0,0,0,0,0,0,0,0,0,0,0
2,2,0,6,1,0,1.0,0,1,,,2.0,1.0,0,1,0,0,0,0,0,1,0,0,0,0,0,0,0,0,0,0,0
2,2,1,13,1,0,1.0,0,1,0.0,0.0,2.0,1.0,1,1,0,0,0,0,0,1,0,1,0,0,0,0,0,0,0,0,0
2,1,1,31,0,0,1.0,0,1,0.0,0.0,2.0,1.0,1,0,1,0,0,0,0,0,0,1,0,0,0,0,0,0,0,0,0
2,2,0,12,1,0,1.0,0,1,,,2.0,1.0,0,0,1,0,0,1,0,0,0,0,0,0,0,0,0,0,0,0,0
2,1,1,32,1,0,1.0,0,1,0.0,0.0,2.0,1.0,1,1,1,0,0,0,0,1,0,1,1,0,0,0,0,0,0,0,0
2,2,0,7,1,0,1.0,0,1,,,2.0,1.0,0,0,1,0,0,0,0,0,0,0,0,0,0,0,0,0,1,0,0
2,1,1,0,0,0,0.0,0,1,0.0,0.0,2.0,1.0,0,1,0,0,0,0,1,1,0,0,0,0,0,0,0,0,0,0,0
2,1,0,85,0,0,3.0,0,1,,,1.0,1.0,1,0,1,0,0,0,0,0,0,0,0,1,0,0,0,0,0,0,0
2,1,1,180,0,0,0.0,0,1,0.0,0.0,2.0,1.0,1,1,0,0,1,0,0,1,0,0,0,1,0,0,0,0,0,0,0
3,2,1,35,1,0,6.0,0,0,,,2.0,0.0,0,0,1,0,0,0,0,0,0,0,0,0,0,0,0,0,0,0,0
2,2,1,12,0,0,1.0,0,1,0.0,0.0,2.0,1.0,0,1,1,0,0,0,0,1,0,0,0,0,0,0,0,0,0,0,0
2,2,0,80,0,0,1.0,0,1,,,2.0,1.0,1,1,1,0,0,0,0,1,0,1,1,1,0,1,0,0,0,0,0
3,2,0,21,1,0,3.0,0,0,,,1.0,0.0,0,0,1,0,0,0,0,0,0,0,1,0,0,0,0,0,1,0,0
2,2,0,9,1,0,1.0,0,1,0.0,0.0,2.0,1.0,1,0,1,0,0,0,0,0,0,0,0,0,0,0,0,0,0,0,0
2,2,1,9,1,0,1.0,0,1,,,1.0,1.0,1,0,0,0,0,0,0,0,0,0,0,1,0,0,0,0,0,0,0
2,2,1,84,1,0,0.0,0,1,,,2.0,1.0,0,1,0,0,0,0,0,1,0,0,0,0,0,0,0,0,0,0,0
2,2,1,33,0,0,1.0,0,1,0.0,0.0,1.0,1.0,0,1,0,0,0,0,0,1,0,0,0,0,0,0,0,0,0,0,0
2,2,0,20,1,0,1.0,0,1,0.0,0.0,2.0,1.0,0,1,0,0,0,0,0,1,0,0,0,0,0,0,0,0,0,0,0
2,2,1,43,1,0,1.0,0,1,0.0,0.0,2.0,1.0,1,0,0,0,0,0,0,0,0,1,0,1,0,0,0,0,0,0,0
2,1,0,215,1,0,1.0,0,1,,,2.0,1.0,0,1,1,0,0,0,0,1,0,0,0,0,0,0,0,0,0,1,0
0,0,0,210,0,0,0.0,1,1,0.0,0.0,1.0,1.0,0,1,0,0,0,0,0,1,0,0,0,0,0,0,0,0,0,0,0
2,0,1,18,1,0,1.0,0,1,0.0,0.0,2.0,1.0,0,1,1,0,1,0,0,1,0,0,0,0,0,0,0,0,0,0,0
0,1,1,26,0,0,1.0,1,1,0.0,0.0,2.0,1.0,0,1,0,0,1,0,1,1,0,0,0,0,0,0,0,0,0,0,0
2,2,1,33,1,0,0.0,0,1,0.0,0.0,2.0,0.0,0,1,0,0,1,0,1,0,1,0,0,0,0,0,0,0,0,0,0
2,1,1,29,1,0,4.0,0,1,,,1.0,1.0,0,0,1,0,0,1,0,0,0,0,0,0,0,0,0,0,0,0,0
2,1,0,141,1,0,6.0,0,1,0.0,0.0,2.0,1.0,0,1,1,0,0,0,0,1,0,0,0,0,0,0,0,0,0,0,0
2,2,0,1,1,0,1.0,0,1,0.0,0.0,2.0,1.0,0,1,1,0,0,0,0,1,0,0,0,0,0,0,0,0,0,0,0
0,2,1,110,1,1,2.0,1,1,0.0,0.0,2.0,1.0,1,0,1,0,0,0,0,0,0,1,1,0,0,0,0,0,0,0,0
2,1,1,153,1,0,1.0,0,1,0.0,0.0,2.0,1.0,0,1,0,0,0,0,0,1,0,0,0,0,0,0,0,0,0,0,0
2,1,0,7,1,0,1.0,0,1,0.0,0.0,2.0,1.0,0,0,1,0,0,0,0,0,0,0,0,0,0,0,0,0,0,0,0
2,2,0,61,1,0,0.0,0,1,,,2.0,1.0,0,1,1,0,0,0,0,1,0,0,1,0,0,0,0,0,0,0,0
2,1,1,28,0,0,1.0,0,1,0.0,0.0,2.0,1.0,0,1,1,1,0,0,0,1,0,0,0,0,0,0,0,0,0,0,0
2,0,1,45,1,0,1.0,0,1,0.0,0.0,2.0,1.0,1,1,0,0,0,0,0,1,0,0,0,1,0,0,0,0,0,0,0
2,1,0,54,1,0,6.0,0,1,,,2.0,0.0,0,0,0,0,1,0,0,0,0,0,0,0,0,0,0,0,0,0,0
2,1,1,11,0,0,1.0,0,1,0.0,0.0,2.0,1.0,0,0,0,0,0,0,0,0,0,0,0,0,0,0,0,0,0,0,0
2,1,0,140,0,0,1.0,0,1,,,2.0,0.0,0,1,1,0,1,0,0,1,0,0,0,0,0,0,0,0,0,0,0